###
### Fri Jul 1 03:15:03 EDT 2005:
### /usr/pkg/bin/bmake bulk-package for libsigc++2-2.0.11
### Current pkg count:  2 installed packages: digest-20050323 efax-0.9
###
BULK> Full rebuild in progress...
BULK> Cleaning package libsigc++2-2.0.11 and pre-requisite packages
===> Cleaning for libsigc++2-2.0.11
===> Cleaning for gmake-3.80nb4
===> Cleaning for gettext-lib-0.11.5nb4
===> Cleaning for libiconv-1.9.2nb1
===> Cleaning for libtool-base-1.5.18nb3
===> Cleaning for pkg_install-info-4.5nb3
===> Cleaning for m4-1.4.3
===> Cleaning for gtexinfo-4.8
BULK> Removing installed packages which are not needed to build libsigc++2-2.0.11
BULK> Keeping BULK_PREREQ: digest-20050323 (pkgtools/digest)
/usr/pkg/sbin/pkg_delete -K /var/db/pkg -r efax-0.9
BULK> Installing packages which are required to build libsigc++2-2.0.11.
BULK>  /usr/pkg/sbin/pkg_add -K /var/db/pkg  /packages/SunOS-5.8/sparc/All/gmake-3.80nb4.tgz
===========================================================================
Installing files needed by libiconv-1.9.2nb1:

	/usr/pkg/lib/charset.alias
	    [/usr/pkg/share/examples/libiconv/charset.alias]

===========================================================================
BULK> Required package gettext-lib-0.11.5nb4 (devel/gettext-lib) is already installed
BULK> Required package libiconv-1.9.2nb1 (converters/libiconv) is already installed
BULK>  /usr/pkg/sbin/pkg_add -K /var/db/pkg  /packages/SunOS-5.8/sparc/All/libtool-base-1.5.18nb3.tgz
BULK> Required package pkg_install-info-4.5nb3 (pkgtools/pkg_install-info) is already installed
BULK>  /usr/pkg/sbin/pkg_add -K /var/db/pkg  /packages/SunOS-5.8/sparc/All/m4-1.4.3.tgz
BULK>  /usr/pkg/sbin/pkg_add -K /var/db/pkg  /packages/SunOS-5.8/sparc/All/gtexinfo-4.8.tgz
BULK> Required package digest-20050323 (pkgtools/digest) is already installed
/usr/pkg/bin/bmake package (libsigc++2-2.0.11)
===> Checking for vulnerabilities in libsigc++2-2.0.11
=> libsigc++-2.0.11.tar.bz2 doesn't seem to exist on this system.
=> Attempting to fetch libsigc++-2.0.11.tar.bz2 from ftp://netbsd.stevens-tech.edu/pub/NetBSD/packages/distfiles/.
=> [1434804 bytes]
=> Checksum SHA1 OK for libsigc++-2.0.11.tar.bz2.
=> Checksum RMD160 OK for libsigc++-2.0.11.tar.bz2.
work -> /pkgobj/devel/libsigc++2/work
===> Extracting for libsigc++2-2.0.11
===> Required installed package libtool-base>=1.5.18nb1: libtool-base-1.5.18nb3 found
===> Required installed package m4>=1.4: m4-1.4.3 found
===> Required installed package gmake>=3.78: gmake-3.80nb4 found
===> Patching for libsigc++2-2.0.11
===> Overriding tools for libsigc++2-2.0.11
===> Creating toolchain wrappers for libsigc++2-2.0.11
===> Configuring for libsigc++2-2.0.11
=> Adding rpaths to pkgconfig files.
configure: WARNING: If you wanted to set the --build type, don't use --host.
    If a cross compiler is detected then cross compile mode will be used.
checking for a BSD-compatible install... /usr/ucb/install -c -o root -g root
checking whether build environment is sane... yes
checking for gawk... /usr/bin/nawk
checking whether make sets $(MAKE)... yes
checking for sparc-sun-solaris2-strip... no
checking for strip... strip
checking how to create a ustar tar archive... plaintar
checking build system type... sparc-sun-solaris2.8
checking host system type... sparc-sun-solaris2
checking for gm4... /usr/pkg/bin/gm4
checking for perl... /usr/bin/perl
checking whether to enable maintainer-specific portions of Makefiles... no
checking for sparc-sun-solaris2-gcc... cc
checking for C compiler default output file name... a.out
checking whether the C compiler works... yes
checking whether we are cross compiling... no
checking for suffix of executables... 
checking for suffix of object files... o
checking whether we are using the GNU C compiler... no
checking whether cc accepts -g... yes
checking for cc option to accept ANSI C... none needed
checking for style of include used by make... GNU
checking dependency style of cc... none
checking how to run the C preprocessor... cc -E
checking for some Win32 platform... no
checking for a sed that does not truncate output... /pkgobj/devel/libsigc++2/work/.tools/bin/sed
checking for egrep... grep -E
checking for non-GNU ld... /pkgobj/devel/libsigc++2/work/.wrapper/bin/ld
checking if the linker (/pkgobj/devel/libsigc++2/work/.wrapper/bin/ld) is GNU ld... no
checking for /pkgobj/devel/libsigc++2/work/.wrapper/bin/ld option to reload object files... -r
checking for BSD-compatible nm... nm
checking whether ln -s works... yes
checking how to recognise dependent libraries... pass_all
checking for ANSI C header files... yes
checking for sys/types.h... yes
checking for sys/stat.h... yes
checking for stdlib.h... yes
checking for string.h... yes
checking for memory.h... yes
checking for strings.h... yes
checking for inttypes.h... yes
checking for stdint.h... no
checking for unistd.h... yes
checking dlfcn.h usability... yes
checking dlfcn.h presence... yes
checking for dlfcn.h... yes
checking for sparc-sun-solaris2-g++... CC
checking whether we are using the GNU C++ compiler... no
checking whether CC accepts -g... yes
checking dependency style of CC... none
checking how to run the C++ preprocessor... CC -E
checking for sparc-sun-solaris2-g77... f77
checking whether we are using the GNU Fortran 77 compiler... no
checking whether f77 accepts -g... no
checking the maximum length of command line arguments... 262144
checking command to parse nm output from cc object... failed
checking for objdir... .libs
checking for sparc-sun-solaris2-ar... no
checking for ar... ar
checking for sparc-sun-solaris2-ranlib... no
checking for ranlib... ranlib
checking for sparc-sun-solaris2-strip... strip
checking if cc static flag  works... yes
checking for cc option to produce PIC... -KPIC
checking if cc PIC flag -KPIC works... yes
checking if cc supports -c -o file.o... yes
checking whether the cc linker (/pkgobj/devel/libsigc++2/work/.wrapper/bin/ld) supports shared libraries... yes
checking dynamic linker characteristics... solaris2 ld.so
checking how to hardcode library paths into programs... immediate
checking whether stripping libraries is possible... no
checking if libtool supports shared libraries... yes
checking whether to build shared libraries... yes
checking whether to build static libraries... yes
configure: creating libtool
appending configuration tag "CXX" to libtool
checking whether the CC linker (/pkgobj/devel/libsigc++2/work/.wrapper/bin/ld) supports shared libraries... yes
checking for CC option to produce PIC... -KPIC
checking if CC PIC flag -KPIC works... yes
checking if CC supports -c -o file.o... yes
checking whether the CC linker (/pkgobj/devel/libsigc++2/work/.wrapper/bin/ld) supports shared libraries... yes
checking dynamic linker characteristics... solaris2 ld.so
checking how to hardcode library paths into programs... immediate
checking whether stripping libraries is possible... no
appending configuration tag "F77" to libtool
checking if libtool supports shared libraries... yes
checking whether to build shared libraries... yes
checking whether to build static libraries... yes
checking for f77 option to produce PIC... -KPIC
checking if f77 PIC flag -KPIC works... no
checking if f77 supports -c -o file.o... no
checking whether the f77 linker (/pkgobj/devel/libsigc++2/work/.wrapper/bin/ld) supports shared libraries... yes
checking dynamic linker characteristics... solaris2 ld.so
checking how to hardcode library paths into programs... immediate
checking whether stripping libraries is possible... no
checking for sparc-sun-solaris2-g++... (cached) CC
checking whether we are using the GNU C++ compiler... (cached) no
checking whether CC accepts -g... (cached) yes
checking dependency style of CC... (cached) none
checking if C++ compiler supports the use of a particular specialization when calling operator() template methods.... no
checking if C++ compiler supports the use of a particular specialization when calling operator() template methods omitting the template keyword.... no
checking whether C++ library symbols are declared in namespace std... yes
configure: creating ./config.status
config.status: creating Makefile
config.status: creating sigc++-2.0.pc
config.status: creating sigc++/Makefile
config.status: creating scripts/Makefile
config.status: creating tests/Makefile
config.status: creating examples/Makefile
config.status: creating MSVC_Net2003/Makefile
config.status: creating MSVC_Net2003/sigc-2.0.rc
config.status: creating libsigc++-2.0.spec
config.status: creating docs/Makefile
config.status: creating docs/manual/Makefile
config.status: creating docs/images/Makefile
config.status: creating docs/reference/Makefile
config.status: creating docs/reference/Doxyfile
config.status: creating sigc++config.h
config.status: executing depfiles commands
===> Building for libsigc++2-2.0.11
 /bin/ksh ./config.status
config.status: creating Makefile
config.status: creating sigc++-2.0.pc
config.status: creating sigc++/Makefile
config.status: creating scripts/Makefile
config.status: creating tests/Makefile
config.status: creating examples/Makefile
config.status: creating MSVC_Net2003/Makefile
config.status: creating MSVC_Net2003/sigc-2.0.rc
config.status: creating libsigc++-2.0.spec
config.status: creating docs/Makefile
config.status: creating docs/manual/Makefile
config.status: creating docs/images/Makefile
config.status: creating docs/reference/Makefile
config.status: creating docs/reference/Doxyfile
config.status: creating sigc++config.h
config.status: sigc++config.h is unchanged
config.status: executing depfiles commands
/usr/pkg/bin/gmake  all-recursive
gmake[1]: Entering directory `/pkgobj/devel/libsigc++2/work/libsigc++-2.0.11'
Making all in sigc++
gmake[2]: Entering directory `/pkgobj/devel/libsigc++2/work/libsigc++-2.0.11/sigc++'
/usr/pkg/bin/gmake  all-am
gmake[3]: Entering directory `/pkgobj/devel/libsigc++2/work/libsigc++-2.0.11/sigc++'
source='signal.cc' object='signal.lo' libtool=yes \
DEPDIR=.deps depmode=none /bin/ksh ../depcomp \
/bin/ksh ../libtool --tag=CXX --mode=compile CC -DHAVE_CONFIG_H   -I.. -I.. -I/usr/include  -O -I/usr/include -c -o signal.lo signal.cc
mkdir .libs
 CC -DHAVE_CONFIG_H -I.. -O -c signal.cc  -KPIC -DPIC -o .libs/signal.o
 CC -DHAVE_CONFIG_H -I.. -O -c signal.cc -o signal.o >/dev/null 2>&1
source='signal_base.cc' object='signal_base.lo' libtool=yes \
DEPDIR=.deps depmode=none /bin/ksh ../depcomp \
/bin/ksh ../libtool --tag=CXX --mode=compile CC -DHAVE_CONFIG_H   -I.. -I.. -I/usr/include  -O -I/usr/include -c -o signal_base.lo signal_base.cc
 CC -DHAVE_CONFIG_H -I.. -O -c signal_base.cc  -KPIC -DPIC -o .libs/signal_base.o
 CC -DHAVE_CONFIG_H -I.. -O -c signal_base.cc -o signal_base.o >/dev/null 2>&1
source='trackable.cc' object='trackable.lo' libtool=yes \
DEPDIR=.deps depmode=none /bin/ksh ../depcomp \
/bin/ksh ../libtool --tag=CXX --mode=compile CC -DHAVE_CONFIG_H   -I.. -I.. -I/usr/include  -O -I/usr/include -c -o trackable.lo trackable.cc
 CC -DHAVE_CONFIG_H -I.. -O -c trackable.cc  -KPIC -DPIC -o .libs/trackable.o
 CC -DHAVE_CONFIG_H -I.. -O -c trackable.cc -o trackable.o >/dev/null 2>&1
source='connection.cc' object='connection.lo' libtool=yes \
DEPDIR=.deps depmode=none /bin/ksh ../depcomp \
/bin/ksh ../libtool --tag=CXX --mode=compile CC -DHAVE_CONFIG_H   -I.. -I.. -I/usr/include  -O -I/usr/include -c -o connection.lo connection.cc
 CC -DHAVE_CONFIG_H -I.. -O -c connection.cc  -KPIC -DPIC -o .libs/connection.o
 CC -DHAVE_CONFIG_H -I.. -O -c connection.cc -o connection.o >/dev/null 2>&1
source='functors/slot.cc' object='slot.lo' libtool=yes \
DEPDIR=.deps depmode=none /bin/ksh ../depcomp \
/bin/ksh ../libtool --tag=CXX --mode=compile CC -DHAVE_CONFIG_H   -I.. -I.. -I/usr/include  -O -I/usr/include -c -o slot.lo `test -f 'functors/slot.cc' || echo './'`functors/slot.cc
 CC -DHAVE_CONFIG_H -I.. -O -c functors/slot.cc  -KPIC -DPIC -o .libs/slot.o
 CC -DHAVE_CONFIG_H -I.. -O -c functors/slot.cc -o slot.o >/dev/null 2>&1
source='functors/slot_base.cc' object='slot_base.lo' libtool=yes \
DEPDIR=.deps depmode=none /bin/ksh ../depcomp \
/bin/ksh ../libtool --tag=CXX --mode=compile CC -DHAVE_CONFIG_H   -I.. -I.. -I/usr/include  -O -I/usr/include -c -o slot_base.lo `test -f 'functors/slot_base.cc' || echo './'`functors/slot_base.cc
 CC -DHAVE_CONFIG_H -I.. -O -c functors/slot_base.cc  -KPIC -DPIC -o .libs/slot_base.o
 CC -DHAVE_CONFIG_H -I.. -O -c functors/slot_base.cc -o slot_base.o >/dev/null 2>&1
source='adaptors/lambda/lambda.cc' object='lambda.lo' libtool=yes \
DEPDIR=.deps depmode=none /bin/ksh ../depcomp \
/bin/ksh ../libtool --tag=CXX --mode=compile CC -DHAVE_CONFIG_H   -I.. -I.. -I/usr/include  -O -I/usr/include -c -o lambda.lo `test -f 'adaptors/lambda/lambda.cc' || echo './'`adaptors/lambda/lambda.cc
 CC -DHAVE_CONFIG_H -I.. -O -c adaptors/lambda/lambda.cc  -KPIC -DPIC -o .libs/lambda.o
 CC -DHAVE_CONFIG_H -I.. -O -c adaptors/lambda/lambda.cc -o lambda.o >/dev/null 2>&1
/bin/ksh ../libtool --tag=CXX --mode=link CC  -O -I/usr/include  -L/usr/lib -R/usr/lib -R/usr/pkg/lib -o libsigc-2.0.la -rpath /usr/pkg/lib  signal.lo signal_base.lo trackable.lo connection.lo slot.lo slot_base.lo lambda.lo  
CC -G -nolib -hlibsigc-2.0.so.0 -o .libs/libsigc-2.0.so.0.0.0   .libs/signal.o .libs/signal_base.o .libs/trackable.o .libs/connection.o .libs/slot.o .libs/slot_base.o .libs/lambda.o  -R/usr/pkg/lib -L/pkgobj/devel/libsigc++2/work/.buildlink/lib  
(cd .libs && rm -f libsigc-2.0.so.0 && ln -s libsigc-2.0.so.0.0.0 libsigc-2.0.so.0)
(cd .libs && rm -f libsigc-2.0.so && ln -s libsigc-2.0.so.0.0.0 libsigc-2.0.so)
CC -xar -o .libs/libsigc-2.0.a   signal.o signal_base.o trackable.o connection.o slot.o slot_base.o lambda.o
creating libsigc-2.0.la
(cd .libs && rm -f libsigc-2.0.la && ln -s ../libsigc-2.0.la libsigc-2.0.la)
gmake[3]: Leaving directory `/pkgobj/devel/libsigc++2/work/libsigc++-2.0.11/sigc++'
gmake[2]: Leaving directory `/pkgobj/devel/libsigc++2/work/libsigc++-2.0.11/sigc++'
Making all in tests
gmake[2]: Entering directory `/pkgobj/devel/libsigc++2/work/libsigc++-2.0.11/tests'
source='test_trackable.cc' object='test_trackable.o' libtool=no \
DEPDIR=.deps depmode=none /bin/ksh ../depcomp \
CC  -I. -I. -I.. -I.. -I..  -I/usr/include  -O -I/usr/include -c -o test_trackable.o test_trackable.cc
/bin/ksh ../libtool --tag=CXX --mode=link CC  -O -I/usr/include  -L/usr/lib -R/usr/lib -R/usr/pkg/lib -o test_trackable  test_trackable.o ../sigc++/libsigc-2.0.la 
mkdir .libs
CC -O -o .libs/test_trackable test_trackable.o  ../sigc++/.libs/libsigc-2.0.so -L/pkgobj/devel/libsigc++2/work/.buildlink/lib -R/usr/pkg/lib
creating test_trackable
source='test_deduce_result_type.cc' object='test_deduce_result_type.o' libtool=no \
DEPDIR=.deps depmode=none /bin/ksh ../depcomp \
CC  -I. -I. -I.. -I.. -I..  -I/usr/include  -O -I/usr/include -c -o test_deduce_result_type.o test_deduce_result_type.cc
/bin/ksh ../libtool --tag=CXX --mode=link CC  -O -I/usr/include  -L/usr/lib -R/usr/lib -R/usr/pkg/lib -o test_deduce_result_type  test_deduce_result_type.o ../sigc++/libsigc-2.0.la 
CC -O -o .libs/test_deduce_result_type test_deduce_result_type.o  ../sigc++/.libs/libsigc-2.0.so -L/pkgobj/devel/libsigc++2/work/.buildlink/lib -R/usr/pkg/lib
creating test_deduce_result_type
source='test_mem_fun.cc' object='test_mem_fun.o' libtool=no \
DEPDIR=.deps depmode=none /bin/ksh ../depcomp \
CC  -I. -I. -I.. -I.. -I..  -I/usr/include  -O -I/usr/include -c -o test_mem_fun.o test_mem_fun.cc
/bin/ksh ../libtool --tag=CXX --mode=link CC  -O -I/usr/include  -L/usr/lib -R/usr/lib -R/usr/pkg/lib -o test_mem_fun  test_mem_fun.o ../sigc++/libsigc-2.0.la 
CC -O -o .libs/test_mem_fun test_mem_fun.o  ../sigc++/.libs/libsigc-2.0.so -L/pkgobj/devel/libsigc++2/work/.buildlink/lib -R/usr/pkg/lib
creating test_mem_fun
source='test_ptr_fun.cc' object='test_ptr_fun.o' libtool=no \
DEPDIR=.deps depmode=none /bin/ksh ../depcomp \
CC  -I. -I. -I.. -I.. -I..  -I/usr/include  -O -I/usr/include -c -o test_ptr_fun.o test_ptr_fun.cc
/bin/ksh ../libtool --tag=CXX --mode=link CC  -O -I/usr/include  -L/usr/lib -R/usr/lib -R/usr/pkg/lib -o test_ptr_fun  test_ptr_fun.o ../sigc++/libsigc-2.0.la 
CC -O -o .libs/test_ptr_fun test_ptr_fun.o  ../sigc++/.libs/libsigc-2.0.so -L/pkgobj/devel/libsigc++2/work/.buildlink/lib -R/usr/pkg/lib
creating test_ptr_fun
source='test_slot.cc' object='test_slot.o' libtool=no \
DEPDIR=.deps depmode=none /bin/ksh ../depcomp \
CC  -I. -I. -I.. -I.. -I..  -I/usr/include  -O -I/usr/include -c -o test_slot.o test_slot.cc
"../sigc++/functors/slot.h", line 136: Error: Unexpected type name "sigc::type_trait::take" encountered.
"../sigc++/functors/slot.h", line 137: Error: "static sigc::internal::slot_call1::call_it(sigc::internal::slot_rep*, std::string &)" cannot return a value.
"../sigc++/functors/slot.h", line 136: Error: Unexpected type name "sigc::type_trait::take" encountered.
"../sigc++/functors/slot.h", line 137: Error: "static sigc::internal::slot_call1::call_it(sigc::internal::slot_rep*, const char&)" cannot return a value.
"../sigc++/functors/slot.h", line 136: Error: Unexpected type name "sigc::type_trait::take" encountered.
"../sigc++/functors/slot.h", line 137: Error: "static sigc::internal::slot_call1::call_it(sigc::internal::slot_rep*, const int&)" cannot return a value.
6 Error(s) detected.
gmake[2]: *** [test_slot.o] Error 6
gmake[2]: Leaving directory `/pkgobj/devel/libsigc++2/work/libsigc++-2.0.11/tests'
gmake[1]: *** [all-recursive] Error 1
gmake[1]: Leaving directory `/pkgobj/devel/libsigc++2/work/libsigc++-2.0.11'
gmake: *** [all] Error 2
*** Error code 2

Stop.
bmake: stopped in /usr/pkgsrc/devel/libsigc++2
===> 
===> There was an error during the ``build'' phase.
===> Please investigate the following for more information:
===>      * log of the build
===>      * /pkgobj/devel/libsigc++2/work/.work.log
===> 
*** Error code 1

Stop.
bmake: stopped in /usr/pkgsrc/devel/libsigc++2

Please view the work log for libsigc++2-2.0.11


BULK> libsigc++2-2.0.11 was marked as broken:
-rw-r--r--   1 root     other      18166 Jul  1 03:18 .broken.html
/usr/pkg/bin/bmake deinstall
===> Deinstalling for libsigc++2
BULK> Marking all packages which depend upon libsigc++2-2.0.11 as broken:
BULK> marking package that requires libsigc++2-2.0.11 as broken: efax-gtk-2.2.15 (comms/efax-gtk)
BULK> marking package that requires libsigc++2-2.0.11 as broken: glibmm24-2.4.5 (devel/glibmm24)
BULK> marking package that requires libsigc++2-2.0.11 as broken: gconfmm26-2.6.1nb1 (devel/gconfmm26)
BULK> marking package that requires libsigc++2-2.0.11 as broken: libgnomeuimm26-2.6.0nb1 (devel/libgnomeuimm26)
BULK> marking package that requires libsigc++2-2.0.11 as broken: gcdmaster-1.2.0nb2 (sysutils/gcdmaster)
BULK> marking package that requires libsigc++2-2.0.11 as broken: gnome-vfsmm26-2.6.1nb1 (sysutils/gnome-vfsmm26)
BULK> marking package that requires libsigc++2-2.0.11 as broken: gtkmm24-2.4.8 (x11/gtkmm24)
BULK> marking package that requires libsigc++2-2.0.11 as broken: libglademm24-2.4.1nb1 (devel/libglademm24)
BULK> marking package that requires libsigc++2-2.0.11 as broken: libgnomemm26-2.6.0nb1 (devel/libgnomemm26)
BULK> marking package that requires libsigc++2-2.0.11 as broken: inkscape-0.41 (graphics/inkscape)
BULK> marking package that requires libsigc++2-2.0.11 as broken: libgnomecanvasmm26-2.6.1nb1 (graphics/libgnomecanvasmm26)
BULK> Build for libsigc++2-2.0.11 was not successful, aborting.